problems compiling app with touchkit on snow leopard: error 133

Hi all,

I am facing a problem trying to compile widgetset that includes the touchkit on vaadin 7 on snow leopard; if I try the same command on linux everyhting’s working fine. I even tried on a clean test project but the problem persists … and I have found nothing on the error neither here or in the gwt forums.
here’s the specs :

$ java -version
java version "1.7.0_45"
Java(TM) SE Runtime Environment (build 1.7.0_45-b18)
Java HotSpot(TM) 64-Bit Server VM (build 24.45-b08, mixed mode)
$ mvn -version
Apache Maven 3.0.4 (r1232337; 2012-01-17 09:44:56+0100)
Maven home: /usr/share/maven
Java version: 1.7.0_45, vendor: Oracle Corporation
Java home: /Library/Java/JavaVirtualMachines/jdk1.7.0_45.jdk/Contents/Home/jre
Default locale: en_US, platform encoding: US-ASCII
OS name: "mac os x", version: "10.6.8", arch: "x86_64", family: "mac"
$  system_profiler SPSoftwareDataType
Software:

    System Software Overview:

      System Version: Mac OS X 10.6.8 (10K549)
      Kernel Version: Darwin 10.8.0
      Boot Volume: MACBOOK
      Boot Mode: Normal
      Computer Name: macho-book
      User Name: Marco Ferretti (marco)
      Secure Virtual Memory: Enabled
      64-bit Kernel and Extensions: No
      Time since boot: 12:00

steps to reproudce :

$ mvn archetype:generate   -DarchetypeGroupId=com.vaadin   -DarchetypeArtifactId=vaadin-archetype-touchkit   -DarchetypeVersion=3.0.0   -DgroupId=example.com -DartifactId=myproject   -Dversion=0.1.0 -Dpackaging=war
$ cd myproject/ && mvn vaadin:compile

output :

[INFO]
 Scanning for projects...
[WARNING]

[WARNING]
 Some problems were encountered while building the effective model for example.com:myproject:war:0.1.0
[WARNING]
 'build.plugins.plugin.version' for org.apache.maven.plugins:maven-compiler-plugin is missing. @ line 80, column 12
[WARNING]

[WARNING]
 It is highly recommended to fix these problems because they threaten the stability of your build.
[WARNING]

[WARNING]
 For this reason, future Maven versions might no longer support building such malformed projects.
[WARNING]

[INFO]
                                                                         
[INFO]
 ------------------------------------------------------------------------
[INFO]
 Building Vaadin TouchKit Web Application 0.1.0
[INFO]
 ------------------------------------------------------------------------
[INFO]

[INFO]
 >>> vaadin-maven-plugin:7.0.7:compile (default-cli) @ myproject >>>
[INFO]

[INFO]
 --- maven-resources-plugin:2.5:resources (default-resources) @ myproject ---
[debug]
 execute contextualize
[INFO]
 Using 'UTF-8' encoding to copy filtered resources.
[INFO]
 skip non existing resourceDirectory /Users/marco/work/workspace/myproject/src/main/resources
[INFO]

[INFO]
 --- vaadin-maven-plugin:7.0.7:resources (default) @ myproject ---
[INFO]
 auto discovered modules [example.com.gwt.AppWidgetSet]

[INFO]
 1 source files from GWT module example.com.gwt.AppWidgetSet
[INFO]

[INFO]
 <<< vaadin-maven-plugin:7.0.7:compile (default-cli) @ myproject <<<
[INFO]

[INFO]
 --- vaadin-maven-plugin:7.0.7:compile (default-cli) @ myproject ---
[INFO]
 auto discovered modules [example.com.gwt.AppWidgetSet]

[INFO]
 Compiling module example.com.gwt.AppWidgetSet
[ERROR]
 2014-03-31 08:19:32.675 java[2152:60f]
 *** NSInvocation: warning: object 0x10a495390 of class 'ThreadUtilities' does not implement methodSignatureForSelector: -- trouble ahead
[ERROR]
 2014-03-31 08:19:32.678 java[2152:60f]
 *** NSInvocation: warning: object 0x10a495390 of class 'ThreadUtilities' does not implement doesNotRecognizeSelector: -- abort
[INFO]
 ------------------------------------------------------------------------
[INFO]
 BUILD FAILURE
[INFO]
 ------------------------------------------------------------------------
[INFO]
 Total time: 8.935s
[INFO]
 Finished at: Mon Mar 31 08:19:33 CEST 2014
[INFO]
 Final Memory: 12M/182M
[INFO]
 ------------------------------------------------------------------------
[ERROR]
 Failed to execute goal com.vaadin:vaadin-maven-plugin:7.0.7:compile (default-cli) on project myproject: Command [[
[ERROR]
 /bin/sh -c /Library/Java/JavaVirtualMachines/jdk1.7.0_45.jdk/Contents/Home/jre/bin/java -Xmx1g -Xss4024k -classpath /Users/marco/work/workspace/myproject/target/classes:/Users/marco/work/workspace/myproject/src/main/java:/Users/marco/work/workspace/myproject/src/main/resources:/Users/marco/.m2/repository/com/vaadin/addon/vaadin-touchkit-agpl/3.0.0/vaadin-touchkit-agpl-3.0.0.jar:/Users/marco/.m2/repository/com/vaadin/vaadin-server/7.0.7/vaadin-server-7.0.7.jar:/Users/marco/.m2/repository/com/vaadin/vaadin-shared/7.0.7/vaadin-shared-7.0.7.jar:/Users/marco/.m2/repository/com/vaadin/vaadin-shared-deps/1.0.2/vaadin-shared-deps-1.0.2.jar:/Users/marco/.m2/repository/com/vaadin/vaadin-theme-compiler/7.0.7/vaadin-theme-compiler-7.0.7.jar:/Users/marco/.m2/repository/org/apache/commons/commons-jexl/2.1.1/commons-jexl-2.1.1.jar:/Users/marco/.m2/repository/commons-cli/commons-cli/1.2/commons-cli-1.2.jar:/Users/marco/.m2/repository/org/jsoup/jsoup/1.6.3/jsoup-1.6.3.jar:/Users/marco/.m2/repository/com/vaadin/vaadin-client/7.0.7/vaadin-client-7.0.7.jar:/Users/marco/.m2/repository/org/w3c/css/sac/1.3/sac-1.3.jar:/Users/marco/.m2/repository/javax/validation/validation-api/1.0.0.GA/validation-api-1.0.0.GA.jar:/Users/marco/.m2/repository/javax/validation/validation-api/1.0.0.GA/validation-api-1.0.0.GA-sources.jar:/Users/marco/.m2/repository/com/vaadin/vaadin-client-compiler/7.0.7/vaadin-client-compiler-7.0.7.jar:/Users/marco/.m2/repository/commons-collections/commons-collections/3.1/commons-collections-3.1.jar:/Users/marco/.m2/repository/ant/ant/1.6.5/ant-1.6.5.jar:/Users/marco/.m2/repository/net/sourceforge/cssparser/cssparser/0.9.5/cssparser-0.9.5.jar:/Users/marco/.m2/repository/ant/ant-launcher/1.6.5/ant-launcher-1.6.5.jar:/Users/marco/.m2/repository/org/mortbay/jetty/jetty/6.1.11/jetty-6.1.11.jar:/Users/marco/.m2/repository/org/mortbay/jetty/servlet-api-2.5/6.1.11/servlet-api-2.5-6.1.11.jar:/Users/marco/.m2/repository/org/mortbay/jetty/jetty-util/6.1.11/jetty-util-6.1.11.jar:/Users/marco/.m2/repository/org/jdesktop/swing-worker/1.1/swing-worker-1.1.jar:/Users/marco/.m2/repository/commons-codec/commons-codec/1.3/commons-codec-1.3.jar:/Users/marco/.m2/repository/commons-io/commons-io/1.4/commons-io-1.4.jar:/Users/marco/.m2/repository/commons-lang/commons-lang/2.6/commons-lang-2.6.jar:/Users/marco/.m2/repository/org/apache/james/apache-mime4j/0.6/apache-mime4j-0.6.jar:/Users/marco/.m2/repository/commons-logging/commons-logging/1.1.1/commons-logging-1.1.1.jar:/Users/marco/.m2/repository/javax/javaee-web-api/6.0/javaee-web-api-6.0.jar:/Users/marco/.m2/repository/com/vaadin/vaadin-client/7.0.7/vaadin-client-7.0.7.jar:/Users/marco/.m2/repository/com/vaadin/vaadin-client-compiler/7.0.7/vaadin-client-compiler-7.0.7.jar -Dgwt.persistentunitcachedir=/Users/marco/work/workspace/myproject/target com.google.gwt.dev.Compiler -logLevel INFO -style OBF -war /Users/marco/work/workspace/myproject/src/main/webapp/VAADIN/widgetsets -localWorkers 2 -XfragmentCount -1 -deploy /Users/marco/work/workspace/myproject/target/gwt-deploy -gen /Users/marco/work/workspace/myproject/target/.generated example.com.gwt.AppWidgetSet
[ERROR]
 ]] failed with status 133
[ERROR]
 -> [Help 1]

[ERROR]

[ERROR]
 To see the full stack trace of the errors, re-run Maven with the -e switch.
[ERROR]
 Re-run Maven using the -X switch to enable full debug logging.
[ERROR]

[ERROR]
 For more information about the errors and possible solutions, please read the following articles:
[ERROR]
 [Help 1]
 http://cwiki.apache.org/confluence/display/MAVEN/MojoExecutionException

that status code at the bottom … “failed with status 133” is something I have never seen before nor I was able to find help about and believe me … I googled a lot; I am starting to think that I may be just too dumb to issue the right search pattern :confused:

Any help would greatly be appreciated.

TIA

Marco